{"text_format":"1","workbook":"xlsx","n_sheets":3,"sheets":["1st Int","2nd Int","DF raw data"],"not_rendered":{"charts":2,"images":0,"macros":1,"external_links":0,"defined_names":649,"comments":0,"pivot_tables":0},"unopened":[],"bounds":{"document_bytes":16777216,"sheet_cells":100000,"rows_first":2000,"rows_last":500,"rows_between":2000,"halvings":0,"cell_chars":16384,"cell_head_chars":4096},"cells_cut":0,"cells_raw":0,"read":"whole","date_system":"1900"}

{"sheet":"1st Int","index":0,"n_rows":30,"n_cols":19,"rows_kept":30,"cut":false,"hidden":false,"merged":[]}
["HXR 1st Integral SW measurements"]
["Background has been subtracted",null,null,null,null,null,null,null,null,null,null,null,"Center values",null,"Average of 3 points x = -2 to x = 2"]
["y pos",0,"mm"]
["Gap nominal",10,"mm",15,"mm",20,"mm",30,"mm",100,"mm",null,"Gap","Ix [muTm]","Iy [muTm]",null,"Gap interval","Ix [muTm]","Iy [muTm]"]
["Encoder",{"$f":"'DF raw data'!B7","v":17221737},null,{"$f":"'DF raw data'!G7","v":17201685},null,{"$f":"'DF raw data'!L7","v":17181656},null,{"$f":"'DF raw data'!Q7","v":17141629},null,{"$f":"'DF raw data'!V7","v":16861665},null,null,{"$f":"B4","v":10},{"$f":"B21","v":2.33893},{"$f":"C21","v":6.7342202000000002},null,"10-30",{"$f":"MAX(N5:N8)-MIN(N5:N8)","v":6.1471299633333336},{"$f":"MAX(O5:O8)-MIN(O5:O8)","v":1.4091035666666674}]
["x pos [mm]","Ix [muTm]","Iy [muTm]","Ix [muTm]","Iy [muTm]","Ix [muTm]","Iy [muTm]","Ix [muTm]","Iy [muTm]","Ix [muTm]","Iy [muTm]",null,{"$f":"D4","v":15},{"$f":"D21","v":3.4125333366666664},{"$f":"E21","v":5.3251166333333328},null,"10-100",{"$f":"MAX(N5:N9)-MIN(N5:N9)","v":7.5333600000000001},{"$f":"MAX(O5:O9)-MIN(O5:O9)","v":1.4091035666666674}]
[-10,{"$f":"'DF raw data'!B9","v":-4.3969002000000001},{"$f":"'DF raw data'!C9","v":14.221489999999999},{"$f":"'DF raw data'!G9","v":-6.2635899000000004},{"$f":"'DF raw data'!H9","v":19.271339000000001},{"$f":"'DF raw data'!L9","v":-5.5745000999999998},{"$f":"'DF raw data'!M9","v":12.90019},{"$f":"'DF raw data'!Q9","v":-7.6660298999999998},{"$f":"'DF raw data'!R9","v":15.18155},{"$f":"'DF raw data'!V9","v":-5.3865600000000002},{"$f":"'DF raw data'!W9","v":10.4308},null,{"$f":"F4","v":20},{"$f":"F21","v":4.1829567000000001},{"$f":"G21","v":5.3323766333333333}]
[-8,{"$f":"'DF raw data'!B10","v":1.1733201},{"$f":"'DF raw data'!C10","v":6.6402998000000002},{"$f":"'DF raw data'!G10","v":-10.359},{"$f":"'DF raw data'!H10","v":4.5550799},{"$f":"'DF raw data'!L10","v":1.7224699999999999},{"$f":"'DF raw data'!M10","v":11.32039},{"$f":"'DF raw data'!Q10","v":7.3720000999999993E-2},{"$f":"'DF raw data'!R10","v":8.9603996000000006},{"$f":"'DF raw data'!V10","v":-3.3345300999999998},{"$f":"'DF raw data'!W10","v":6.8810101000000001},null,{"$f":"H4","v":30},{"$f":"H21","v":-1.9641732633333333},{"$f":"I21","v":6.2287999333333337},null,"Accept criteria:"]
[-6,{"$f":"'DF raw data'!B11","v":10.504189999999999},{"$f":"'DF raw data'!C11","v":9.1774301999999999},{"$f":"'DF raw data'!G11","v":-7.3316998},{"$f":"'DF raw data'!H11","v":13.03016},{"$f":"'DF raw data'!L11","v":1.0025299999999999},{"$f":"'DF raw data'!M11","v":9.0402497999999998},{"$f":"'DF raw data'!Q11","v":2.2349000000000001},{"$f":"'DF raw data'!R11","v":8.9984903000000003},{"$f":"'DF raw data'!V11","v":-4.6210998999999999},{"$f":"'DF raw data'!W11","v":7.0997801000000003},null,{"$f":"J4","v":100},{"$f":"J21","v":-3.3504033},{"$f":"K21","v":5.4135835000000005},null,"Max for 10-30:",15,15]
[-4,{"$f":"'DF raw data'!B12","v":5.5775598999999998},{"$f":"'DF raw data'!C12","v":11.545489999999999},{"$f":"'DF raw data'!G12","v":-4.6191902000000002},{"$f":"'DF raw data'!H12","v":18.46022},{"$f":"'DF raw data'!L12","v":-1.2378499999999999},{"$f":"'DF raw data'!M12","v":17.195070000000001},{"$f":"'DF raw data'!Q12","v":0.70446998000000005},{"$f":"'DF raw data'!R12","v":13.52768},{"$f":"'DF raw data'!V12","v":-2.7291300000000001},{"$f":"'DF raw data'!W12","v":5.5143700000000004},null,null,null,null,null,"Test result",{"$f":"IF(R5<R9,\"Pass\",\"Fail\")","v":"Pass"},{"$f":"IF(S5<S9,\"Pass\",\"Fail\")","v":"Pass"}]
[-2,{"$f":"'DF raw data'!B13","v":4.7833199999999998},{"$f":"'DF raw data'!C13","v":2.0881099999999999},{"$f":"'DF raw data'!G13","v":-0.25986999},{"$f":"'DF raw data'!H13","v":-2.8777298999999998},{"$f":"'DF raw data'!L13","v":4.9859400000000003},{"$f":"'DF raw data'!M13","v":4.7781301000000003},{"$f":"'DF raw data'!Q13","v":-2.3215599},{"$f":"'DF raw data'!R13","v":1.9456599999999999},{"$f":"'DF raw data'!V13","v":-5.2756499999999997},{"$f":"'DF raw data'!W13","v":-2.16168},null,"Accept criteria:"]
[0,{"$f":"'DF raw data'!B14","v":-6.4676399},{"$f":"'DF raw data'!C14","v":8.3891802000000002},{"$f":"'DF raw data'!G14","v":-1.88008},{"$f":"'DF raw data'!H14","v":13.66151},{"$f":"'DF raw data'!L14","v":3.4684800999999998},{"$f":"'DF raw data'!M14","v":6.4206799999999999},{"$f":"'DF raw data'!Q14","v":0.83068001000000002},{"$f":"'DF raw data'!R14","v":9.1364698000000004},{"$f":"'DF raw data'!V14","v":-2.5324099000000002},{"$f":"'DF raw data'!W14","v":9.2498903000000006},null,"Values within: +/-",17.5,17.5]
[2,{"$f":"'DF raw data'!B15","v":8.7011099000000005},{"$f":"'DF raw data'!C15","v":9.7253703999999992},{"$f":"'DF raw data'!G15","v":12.377549999999999},{"$f":"'DF raw data'!H15","v":5.1915697999999999},{"$f":"'DF raw data'!L15","v":4.0944500000000001},{"$f":"'DF raw data'!M15","v":4.7983197999999998},{"$f":"'DF raw data'!Q15","v":-4.4016399000000002},{"$f":"'DF raw data'!R15","v":7.6042699999999996},{"$f":"'DF raw data'!V15","v":-2.24315},{"$f":"'DF raw data'!W15","v":9.1525402000000007},null,"Test result",{"$f":"IF(MAX(N$5:N$9)<N$12,IF(MIN(N$5:N$9)>-1*N12,\"Pass\",\"Fail\"),\"Fail\")","v":"Pass"},{"$f":"IF(MAX(O$5:O$9)<O$12,IF(MIN(O$5:O$9)>-1*O12,\"Pass\",\"Fail\"),\"Fail\")","v":"Pass"}]
[4,{"$f":"'DF raw data'!B16","v":4.7386698999999997},{"$f":"'DF raw data'!C16","v":3.1978499999999999},{"$f":"'DF raw data'!G16","v":3.8509600000000002},{"$f":"'DF raw data'!H16","v":1.81511},{"$f":"'DF raw data'!L16","v":4.4820900000000004},{"$f":"'DF raw data'!M16","v":3.7944499999999999},{"$f":"'DF raw data'!Q16","v":1.73384},{"$f":"'DF raw data'!R16","v":4.3744202000000003},{"$f":"'DF raw data'!V16","v":-0.15773000000000001},{"$f":"'DF raw data'!W16","v":-0.84543997000000004}]
[6,{"$f":"'DF raw data'!B17","v":-0.49972999000000001},{"$f":"'DF raw data'!C17","v":9.7996101000000007},{"$f":"'DF raw data'!G17","v":4.6564297999999997},{"$f":"'DF raw data'!H17","v":5.6122899000000004},{"$f":"'DF raw data'!L17","v":2.0755799000000001},{"$f":"'DF raw data'!M17","v":10.53697},{"$f":"'DF raw data'!Q17","v":-2.5315498999999999},{"$f":"'DF raw data'!R17","v":10.79688},{"$f":"'DF raw data'!V17","v":-5.5895801000000001},{"$f":"'DF raw data'!W17","v":8.5372199999999996}]
[8,{"$f":"'DF raw data'!B18","v":2.8903401},{"$f":"'DF raw data'!C18","v":4.7508701999999996},{"$f":"'DF raw data'!G18","v":-1.9879800000000001},{"$f":"'DF raw data'!H18","v":6.0141301},{"$f":"'DF raw data'!L18","v":-0.85541999000000002},{"$f":"'DF raw data'!M18","v":5.1718102000000004},{"$f":"'DF raw data'!Q18","v":-4.2478899999999999},{"$f":"'DF raw data'!R18","v":8.2229500000000009},{"$f":"'DF raw data'!V18","v":-6.6420998999999998},{"$f":"'DF raw data'!W18","v":2.8908200000000002}]
[10,{"$f":"'DF raw data'!B19","v":-0.79767001000000004},{"$f":"'DF raw data'!C19","v":7.6264801000000002},{"$f":"'DF raw data'!G19","v":0.46359},{"$f":"'DF raw data'!H19","v":6.5458297999999999},{"$f":"'DF raw data'!L19","v":-6.21807},{"$f":"'DF raw data'!M19","v":5.0285000999999996},{"$f":"'DF raw data'!Q19","v":-5.1016402000000003},{"$f":"'DF raw data'!R19","v":8.1934404000000001},{"$f":"'DF raw data'!V19","v":-4.77562},{"$f":"'DF raw data'!W19","v":3.3285501000000002}]
[]
["DF indice",{"$f":"'DF raw data'!B4","v":910},null,{"$f":"'DF raw data'!G4","v":911},null,{"$f":"'DF raw data'!L4","v":912},null,{"$f":"'DF raw data'!Q4","v":913},null,{"$f":"'DF raw data'!V4","v":914}]
[]
["Average",{"$f":"AVERAGE(B11:B13)","v":2.33893},{"$f":"AVERAGE(C11:C13)","v":6.7342202000000002},3.4125333366666664,5.3251166333333328,4.1829567000000001,5.3323766333333333,-1.9641732633333333,6.2287999333333337,-3.3504033,5.4135835000000005]
[]
[]
[]
[]
[]
[]
[]
[]
[null,null,null,null,null,null,null,null,null,null,null,null,null," "]

{"sheet":"2nd Int","index":1,"n_rows":21,"n_cols":19,"rows_kept":21,"cut":false,"hidden":false,"merged":[]}
["HXR 2nd Integral SW measurements"]
["Background has been subtracted",null,null,null,null,null,null,null,null,null,null,null,"Center values",null,"Average of 3 points x = -2 to x = 2"]
["y pos",0,"mm"]
["Gap",10,"mm",15,"mm",20,"mm",30,"mm",100,"mm",null,"Gap","Jx [muTm^2]","Jy [muTm^2]",null,"Gap interval","Jx [muTm^2]","Jy [muTm^2]"]
["Encoder",{"$f":"'DF raw data'!B7","v":17221737},null,{"$f":"'DF raw data'!G7","v":17201685},null,{"$f":"'DF raw data'!L7","v":17181656},null,{"$f":"'DF raw data'!Q7","v":17141629},null,{"$f":"'DF raw data'!V7","v":16861665},null,null,{"$f":"B4","v":10},{"$f":"B21","v":2.2790670999999993},{"$f":"C21","v":9.2845085666666662},null,"10-30",{"$f":"MAX(N5:N8)-MIN(N5:N8)","v":17.304721103333332},{"$f":"MAX(O5:O8)-MIN(O5:O8)","v":8.2815235000000023}]
["x pos [mm]","Jx [muTm^2]","Jy [muTm^2]","Jx [muTm^2]","Jy [muTm^2]","Jx [muTm^2]","Jy [muTm^2]","Jx [muTm^2]","Jy [muTm^2]","Jx [muTm^2]","Jy [muTm^2]",null,{"$f":"D4","v":15},{"$f":"D21","v":-1.0844546666666659},{"$f":"E21","v":17.566032066666668},null,"10-100",{"$f":"MAX(N5:N9)-MIN(N5:N9)","v":17.304721103333332},{"$f":"MAX(O5:O9)-MIN(O5:O9)","v":8.2815235000000023}]
[-10,{"$f":"'DF raw data'!D9/100","v":6.4160968},{"$f":"'DF raw data'!E9/100","v":26.729902000000003},{"$f":"'DF raw data'!I9/100","v":9.1251935},{"$f":"'DF raw data'!J9/100","v":27.187128999999999},{"$f":"'DF raw data'!N9/100","v":1.0650739},{"$f":"'DF raw data'!O9/100","v":33.539735999999998},{"$f":"'DF raw data'!S9/100","v":-2.8348047000000003},{"$f":"'DF raw data'!T9/100","v":29.503681999999998},{"$f":"'DF raw data'!X9/100","v":4.7911291999999994},{"$f":"'DF raw data'!Y9/100","v":25.934307},null,{"$f":"F4","v":20},{"$f":"F21","v":5.0311153033333333},{"$f":"G21","v":13.491526899999998}]
[-8,{"$f":"'DF raw data'!D10/100","v":6.7663122999999992},{"$f":"'DF raw data'!E10/100","v":21.491835999999999},{"$f":"'DF raw data'!I10/100","v":-1.6050107},{"$f":"'DF raw data'!J10/100","v":23.383485999999998},{"$f":"'DF raw data'!N10/100","v":2.1442245},{"$f":"'DF raw data'!O10/100","v":27.911747999999999},{"$f":"'DF raw data'!S10/100","v":23.426804000000001},{"$f":"'DF raw data'!T10/100","v":1.7336522999999999},{"$f":"'DF raw data'!X10/100","v":-14.047981},{"$f":"'DF raw data'!Y10/100","v":22.051680000000001},null,{"$f":"H4","v":30},{"$f":"H21","v":-12.273605799999999},{"$f":"I21","v":13.621129333333334}]
[-6,{"$f":"'DF raw data'!D11/100","v":27.311491999999998},{"$f":"'DF raw data'!E11/100","v":17.924970999999999},{"$f":"'DF raw data'!I11/100","v":-7.0465588000000006},{"$f":"'DF raw data'!J11/100","v":33.944735999999999},{"$f":"'DF raw data'!N11/100","v":5.1210595999999997},{"$f":"'DF raw data'!O11/100","v":12.614697000000001},{"$f":"'DF raw data'!S11/100","v":8.2218695000000004},{"$f":"'DF raw data'!T11/100","v":9.3186621000000009},{"$f":"'DF raw data'!X11/100","v":0.99009338000000002},{"$f":"'DF raw data'!Y11/100","v":17.274443000000002},null,{"$f":"J4","v":100},{"$f":"J21","v":-4.4872878666666667},{"$f":"K21","v":11.293020833333335}]
[-4,{"$f":"'DF raw data'!D12/100","v":6.5943768},{"$f":"'DF raw data'!E12/100","v":30.906278999999998},{"$f":"'DF raw data'!I12/100","v":-11.183752},{"$f":"'DF raw data'!J12/100","v":40.147852},{"$f":"'DF raw data'!N12/100","v":-8.442180200000001},{"$f":"'DF raw data'!O12/100","v":38.710410000000003},{"$f":"'DF raw data'!S12/100","v":1.0374257},{"$f":"'DF raw data'!T12/100","v":25.086221000000002},{"$f":"'DF raw data'!X12/100","v":-0.92942612000000002},{"$f":"'DF raw data'!Y12/100","v":18.881387}]
[-2,{"$f":"'DF raw data'!D13/100","v":1.3073760999999999},{"$f":"'DF raw data'!E13/100","v":6.0356249999999996},{"$f":"'DF raw data'!I13/100","v":-11.093423},{"$f":"'DF raw data'!J13/100","v":3.7810351999999998},{"$f":"'DF raw data'!N13/100","v":-0.62464728999999997},{"$f":"'DF raw data'!O13/100","v":5.4240137000000006},{"$f":"'DF raw data'!S13/100","v":-36.808917999999998},{"$f":"'DF raw data'!T13/100","v":14.520674},{"$f":"'DF raw data'!X13/100","v":-8.0643908999999994},{"$f":"'DF raw data'!Y13/100","v":-5.5760645000000002},null,"Accept criteria:"]
[0,{"$f":"'DF raw data'!D14/100","v":-8.8973328000000009},{"$f":"'DF raw data'!E14/100","v":9.4071777000000001},{"$f":"'DF raw data'!I14/100","v":-13.157885},{"$f":"'DF raw data'!J14/100","v":37.219053000000002},{"$f":"'DF raw data'!N14/100","v":4.0556301999999995},{"$f":"'DF raw data'!O14/100","v":20.523339999999997},{"$f":"'DF raw data'!S14/100","v":2.0974365000000001},{"$f":"'DF raw data'!T14/100","v":13.899061999999999},{"$f":"'DF raw data'!X14/100","v":-10.751899000000002},{"$f":"'DF raw data'!Y14/100","v":16.943877000000001},null,"Values within: +/-",42.5,42.5]
[2,{"$f":"'DF raw data'!D15/100","v":14.427157999999999},{"$f":"'DF raw data'!E15/100","v":12.410723000000001},{"$f":"'DF raw data'!I15/100","v":20.997944000000004},{"$f":"'DF raw data'!J15/100","v":11.698008},{"$f":"'DF raw data'!N15/100","v":11.662363000000001},{"$f":"'DF raw data'!O15/100","v":14.527227},{"$f":"'DF raw data'!S15/100","v":-2.1093359},{"$f":"'DF raw data'!T15/100","v":12.443652},{"$f":"'DF raw data'!X15/100","v":5.3544263000000001},{"$f":"'DF raw data'!Y15/100","v":22.51125},null,"Test result",{"$f":"IF(MAX(N$5:N$9)<N$12,IF(MIN(N$5:N$9)>-1*N12,\"Pass\",\"Fail\"),\"Fail\")","v":"Pass"},{"$f":"IF(MAX(O$5:O$9)<O$12,IF(MIN(O$5:O$9)>-1*O12,\"Pass\",\"Fail\"),\"Fail\")","v":"Pass"}]
[4,{"$f":"'DF raw data'!D16/100","v":11.739277},{"$f":"'DF raw data'!E16/100","v":13.925869},{"$f":"'DF raw data'!I16/100","v":-1.9564557},{"$f":"'DF raw data'!J16/100","v":9.1432227000000008},{"$f":"'DF raw data'!N16/100","v":9.5200513000000004},{"$f":"'DF raw data'!O16/100","v":18.943114999999999},{"$f":"'DF raw data'!S16/100","v":3.1160669000000003},{"$f":"'DF raw data'!T16/100","v":8.2807715000000002},{"$f":"'DF raw data'!X16/100","v":-0.47935550999999998},{"$f":"'DF raw data'!Y16/100","v":12.617177999999999}]
[6,{"$f":"'DF raw data'!D17/100","v":-0.90334900000000007},{"$f":"'DF raw data'!E17/100","v":10.459453000000002},{"$f":"'DF raw data'!I17/100","v":6.8274860000000004},{"$f":"'DF raw data'!J17/100","v":14.766113000000001},{"$f":"'DF raw data'!N17/100","v":18.826401000000001},{"$f":"'DF raw data'!O17/100","v":26.555790999999999},{"$f":"'DF raw data'!S17/100","v":-3.4520502},{"$f":"'DF raw data'!T17/100","v":12.929658},{"$f":"'DF raw data'!X17/100","v":-6.3914075000000006},{"$f":"'DF raw data'!Y17/100","v":13.192471000000001}]
[8,{"$f":"'DF raw data'!D18/100","v":5.5562463000000006},{"$f":"'DF raw data'!E18/100","v":19.012949000000003},{"$f":"'DF raw data'!I18/100","v":3.2514609000000001},{"$f":"'DF raw data'!J18/100","v":23.061356999999997},{"$f":"'DF raw data'!N18/100","v":6.9188280999999998},{"$f":"'DF raw data'!O18/100","v":11.490938000000002},{"$f":"'DF raw data'!S18/100","v":-5.2029816000000002},{"$f":"'DF raw data'!T18/100","v":25.538701},{"$f":"'DF raw data'!X18/100","v":-9.1279369999999993},{"$f":"'DF raw data'!Y18/100","v":11.030693000000001}]
[10,{"$f":"'DF raw data'!D19/100","v":-0.59970020000000002},{"$f":"'DF raw data'!E19/100","v":12.064619},{"$f":"'DF raw data'!I19/100","v":1.8912421000000001},{"$f":"'DF raw data'!J19/100","v":10.199727000000001},{"$f":"'DF raw data'!N19/100","v":-12.939199},{"$f":"'DF raw data'!O19/100","v":7.6271582000000002},{"$f":"'DF raw data'!S19/100","v":-2.5154633},{"$f":"'DF raw data'!T19/100","v":11.523065999999998},{"$f":"'DF raw data'!X19/100","v":-4.5422174000000002},{"$f":"'DF raw data'!Y19/100","v":-1.403877}]
[]
["DF indice",{"$f":"'DF raw data'!B4","v":910},null,{"$f":"'DF raw data'!G4","v":911},null,{"$f":"'DF raw data'!L4","v":912},null,{"$f":"'DF raw data'!Q4","v":913},null,{"$f":"'DF raw data'!V4","v":914}]
[]
["Average",{"$f":"AVERAGE(B11:B13)","v":2.2790670999999993},{"$f":"AVERAGE(C11:C13)","v":9.2845085666666662},-1.0844546666666659,17.566032066666668,5.0311153033333333,13.491526899999998,-12.273605799999999,13.621129333333334,-4.4872878666666667,11.293020833333335]

{"sheet":"DF raw data","index":2,"n_rows":19,"n_cols":25,"rows_kept":19,"cut":false,"hidden":false,"merged":[]}
["Comment:","2nd Int scan, PS 16332, 10 mm gap",null,null,null,"Comment:","2nd Int scan, PS 16332, 15 mm gap",null,null,null,"Comment:","2nd Int scan, PS 16332, 20 mm gap",null,null,null,"Comment:","2nd Int scan, PS 16332, 30 mm gap",null,null,null,"Comment:","2nd Int scan, PS 16332, 100 mm gap"]
["Date:","9. okt 2017","17:07:49",null,null,"Date:","10. okt 2017","11:10:19",null,null,"Date:","10. okt 2017","11:10:23",null,null,"Date:","9. okt 2017","16:53:43",null,null,"Date:","9. okt 2017","17:07:49"]
["Z-Pos:",0,null,null,null,"Z-Pos:",0,null,null,null,"Z-Pos:",0,null,null,null,"Z-Pos:",0,null,null,null,"Z-Pos:",0]
["Indice:",910,null,null,null,"Indice:",911,null,null,null,"Indice:",912,null,null,null,"Indice:",913,null,null,null,"Indice:",914]
["Background Indice:",910,null,null,null,"Background Indice:",911,null,null,null,"Background Indice:",912,null,null,null,"Background Indice:",913,null,null,null,"Background Indice:",914]
["Temperature:",21.47,null,null,null,"Temperature:",21.46,null,null,null,"Temperature:",21.51,null,null,null,"Temperature:",21.49,null,null,null,"Temperature:",21.5]
["Encoder:",17221737,null,null,null,"Encoder:",17201685,null,null,null,"Encoder:",17181656,null,null,null,"Encoder:",17141629,null,null,null,"Encoder:",16861665]
["X","IXb","IZb","JXb","JZb","X","IXb","IZb","JXb","JZb","X","IXb","IZb","JXb","JZb","X","IXb","IZb","JXb","JZb","X","IXb","IZb","JXb","JZb"]
[-1,-4.3969002000000001,14.221489999999999,641.60968000000003,2672.9902000000002,-1,-6.2635899000000004,19.271339000000001,912.51935000000003,2718.7129,-1,-5.5745000999999998,12.90019,106.50739,3353.9735999999998,-1,-7.6660298999999998,15.18155,-283.48047000000003,2950.3681999999999,-1,-5.3865600000000002,10.4308,479.11291999999997,2593.4306999999999]
[-0.80000000999999998,1.1733201,6.6402998000000002,676.63122999999996,2149.1835999999998,-0.80000000999999998,-10.359,4.5550799,-160.50107,2338.3485999999998,-0.80000000999999998,1.7224699999999999,11.32039,214.42245,2791.1747999999998,-0.80000000999999998,7.3720000999999993E-2,8.9603996000000006,2342.6804000000002,173.36523,-0.80000000999999998,-3.3345300999999998,6.8810101000000001,-1404.7981,2205.1680000000001]
[-0.60000001999999997,10.504189999999999,9.1774301999999999,2731.1491999999998,1792.4971,-0.60000001999999997,-7.3316998,13.03016,-704.65588000000002,3394.4735999999998,-0.60000001999999997,1.0025299999999999,9.0402497999999998,512.10595999999998,1261.4697000000001,-0.60000001999999997,2.2349000000000001,8.9984903000000003,822.18695000000002,931.86621000000002,-0.60000001999999997,-4.6210998999999999,7.0997801000000003,99.009338,1727.4443000000001]
[-0.40000001000000002,5.5775598999999998,11.545489999999999,659.43768,3090.6279,-0.40000001000000002,-4.6191902000000002,18.46022,-1118.3751999999999,4014.7851999999998,-0.40000001000000002,-1.2378499999999999,17.195070000000001,-844.21802000000002,3871.0410000000002,-0.40000001000000002,0.70446998000000005,13.52768,103.74257,2508.6221,-0.40000001000000002,-2.7291300000000001,5.5143700000000004,-92.942611999999997,1888.1387]
[-0.2,4.7833199999999998,2.0881099999999999,130.73760999999999,603.5625,-0.2,-0.25986999,-2.8777298999999998,-1109.3423,378.10352,-0.2,4.9859400000000003,4.7781301000000003,-62.464728999999998,542.40137000000004,-0.2,-2.3215599,1.9456599999999999,-3680.8917999999999,1452.0673999999999,-0.2,-5.2756499999999997,-2.16168,-806.43908999999996,-557.60645]
[0,-6.4676399,8.3891802000000002,-889.73328000000004,940.71776999999997,0,-1.88008,13.66151,-1315.7885000000001,3721.9052999999999,0,3.4684800999999998,6.4206799999999999,405.56301999999999,2052.3339999999998,0,0.83068001000000002,9.1364698000000004,209.74365,1389.9061999999999,0,-2.5324099000000002,9.2498903000000006,-1075.1899000000001,1694.3877]
[0.2,8.7011099000000005,9.7253703999999992,1442.7157999999999,1241.0723,0.2,12.377549999999999,5.1915697999999999,2099.7944000000002,1169.8008,0.2,4.0944500000000001,4.7983197999999998,1166.2363,1452.7227,0.2,-4.4016399000000002,7.6042699999999996,-210.93359000000001,1244.3652,0.2,-2.24315,9.1525402000000007,535.44263000000001,2251.125]
[0.40000001000000002,4.7386698999999997,3.1978499999999999,1173.9277,1392.5869,0.40000001000000002,3.8509600000000002,1.81511,-195.64556999999999,914.32227,0.40000001000000002,4.4820900000000004,3.7944499999999999,952.00513000000001,1894.3115,0.40000001000000002,1.73384,4.3744202000000003,311.60669000000001,828.07714999999996,0.40000001000000002,-0.15773000000000001,-0.84543997000000004,-47.935550999999997,1261.7177999999999]
[0.60000001999999997,-0.49972999000000001,9.7996101000000007,-90.334900000000005,1045.9453000000001,0.60000001999999997,4.6564297999999997,5.6122899000000004,682.74860000000001,1476.6113,0.60000001999999997,2.0755799000000001,10.53697,1882.6401000000001,2655.5790999999999,0.60000001999999997,-2.5315498999999999,10.79688,-345.20501999999999,1292.9657999999999,0.60000001999999997,-5.5895801000000001,8.5372199999999996,-639.14075000000003,1319.2471]
[0.80000000999999998,2.8903401,4.7508701999999996,555.62463000000002,1901.2949000000001,0.80000000999999998,-1.9879800000000001,6.0141301,325.14609000000002,2306.1356999999998,0.80000000999999998,-0.85541999000000002,5.1718102000000004,691.88280999999995,1149.0938000000001,0.80000000999999998,-4.2478899999999999,8.2229500000000009,-520.29816000000005,2553.8701000000001,0.80000000999999998,-6.6420998999999998,2.8908200000000002,-912.79369999999994,1103.0693000000001]
[1,-0.79767001000000004,7.6264801000000002,-59.970019999999998,1206.4619,1,0.46359,6.5458297999999999,189.12421000000001,1019.9727,1,-6.21807,5.0285000999999996,-1293.9199000000001,762.71582000000001,1,-5.1016402000000003,8.1934404000000001,-251.54633000000001,1152.3065999999999,1,-4.77562,3.3285501000000002,-454.22174000000001,-140.3877]